编译,打包,安装遇到的问题


#1

按照教程一步步学习。

目前编译后无法打包。

编译中的打印内容如下
yijiudeMac-Pro:springboardtest ikyuu$ make

Making all for tweak MyFirstReProject…
==> Preprocessing Tweak.xm…
==> Compiling Tweak.xm (arm64)…
==> Linking tweak MyFirstReProject (arm64)…
==> Generating debug symbols for MyFirstReProject (arm64)…
warning: no debug symbols in executable (-arch arm64)
==> Stripping MyFirstReProject (arm64)…
==> Merging tweak MyFirstReProject…
==> Signing MyFirstReProject…
yijiudeMac-Pro:springboardtest ikyuu$

warning: no debug symbols in executable (-arch arm64)这句警告是导致问题的原因??

打包就出现更多看不懂的了。
yijiudeMac-Pro:springboardtest ikyuu$ make package

Making all for tweak MyFirstReProject…
make[2]: Nothing to be done for internal-library-compile'. Making stage for tweak MyFirstReProject… ==> Error: You are missing a filter property list. Make sure it’s named MyFirstReProject.plist. Refer to http://iphonedevwiki.net/index.php/Cydia_Substrate#MobileLoader. make[1]: *** [internal-tweak-stage_] Error 1 make: *** [MyFirstReProject.stage.tweak.variables] Error 2 yijiudeMac-Pro:springboardtest ikyuu$ make package Making all for tweak MyFirstReProject… make[2]: Nothing to be done forinternal-library-compile’.
Making stage for tweak MyFirstReProject…
Can’t locate Compress/Raw/Lzma.pm in @INC (you may need to install the Compress::Raw::Lzma module) (@INC contains: /usr/local/Cellar/perl/5.26.1/lib/perl5/site_perl/5.26.1/darwin-thread-multi-2level /usr/local/Cellar/perl/5.26.1/lib/perl5/site_perl/5.26.1 /usr/local/Cellar/perl/5.26.1/lib/perl5/5.26.1/darwin-thread-multi-2level /usr/local/Cellar/perl/5.26.1/lib/perl5/5.26.1 /usr/local/lib/perl5/site_perl/5.26.1/darwin-thread-multi-2level /usr/local/lib/perl5/site_perl/5.26.1) at /usr/local/Cellar/perl/5.26.1/lib/perl5/site_perl/5.26.1/IO/Compress/Adapter/Lzma.pm line 9.
BEGIN failed–compilation aborted at /usr/local/Cellar/perl/5.26.1/lib/perl5/site_perl/5.26.1/IO/Compress/Adapter/Lzma.pm line 9.
Compilation failed in require at /usr/local/Cellar/perl/5.26.1/lib/perl5/site_perl/5.26.1/IO/Compress/Lzma.pm line 11.
BEGIN failed–compilation aborted at /usr/local/Cellar/perl/5.26.1/lib/perl5/site_perl/5.26.1/IO/Compress/Lzma.pm line 11.
Compilation failed in require at /Users/ikyuu/opt/theos/bin/dm.pl line 12.
BEGIN failed–compilation aborted at /Users/ikyuu/opt/theos/bin/dm.pl line 12.
make: *** [internal-package] Error 2

希望大神能指点一下小白,谢谢


#2

用cpan装LZMA


#3

谢谢,稀里糊涂装好了 lzma 打包成功 安装成功 第一次成功了。内心狂喜


#4

请教个问题,我遇见和你一样的问题了, 装了 LZMA 还是打包不成功啊, 请我你是怎么安装的啊?